{"text_format":"3","workbook":"xlsx","n_sheets":5,"sheets":["Vordruck","Tabelle","Tabelle Vergleich","Nebenrechnung","Tabelle Abschlagsber"],"not_rendered":{"defined_names":18,"comments":2},"read":"whole","date_system":"1900"}

{"sheet":"Vordruck","index":0,"n_rows":65,"n_cols":289,"rows_kept":65,"merged":[[2,1,2,12],[4,1,4,12],[11,4,11,10],[13,4,13,10],[18,266,18,269],[18,271,18,274],[19,7,19,9],[19,10,19,11],[19,20,20,20],[19,21,20,21],[19,22,19,23],[19,39,20,39],[19,40,20,40],[19,41,20,41],[19,42,20,42],[19,43,19,44],[19,45,20,45],[19,46,20,46],[19,47,19,48],[19,59,20,59],[19,60,20,60],[19,61,19,62],[19,83,20,83],[19,84,20,84],[19,87,20,87],[19,88,19,89],[19,95,20,95],[19,96,20,96],[19,99,20,99],[19,100,19,101],[19,108,20,108],[19,109,20,109],[19,112,20,112],[19,113,19,114],[19,121,20,121],[19,122,20,122],[19,125,20,125],[19,126,19,127],[19,139,20,139],[19,140,20,140],[19,141,19,142],[19,150,20,150],[19,151,19,152],[19,159,20,159],[19,160,20,160],[19,163,20,163],[19,164,19,165],[19,172,20,172],[19,173,20,173],[19,174,19,175],[19,183,20,183],[19,184,19,185],[19,192,20,192],[19,193,20,193],[19,194,19,195],[19,203,20,203],[19,204,19,205],[19,212,20,212],[19,213,20,213],[19,216,20,216],[19,217,19,218],[19,225,20,225],[19,226,20,226],[19,229,20,229],[19,230,19,231],[19,241,20,241],[19,242,20,242],[19,245,20,245],[19,246,19,247],[19,258,20,258],[19,259,20,259],[19,260,19,261],[19,276,19,277],[21,1,21,3],[22,1,22,3],[23,1,23,3],[24,1,24,3],[25,1,25,3],[26,1,26,3],[27,1,27,3],[28,1,28,3],[29,1,29,3],[30,1,30,3],[31,1,31,3],[32,1,32,3],[33,1,33,3],[34,1,34,3],[35,1,35,3],[36,1,36,3],[37,1,37,3],[38,1,38,3],[39,1,39,3],[40,1,40,3],[41,1,41,3],[42,1,42,3],[43,1,43,3],[44,1,44,3],[45,1,45,3]]}
[{"$nulls":14},"Anfang",{"$nulls":273},"Ende"]
[]
[null,"Versorgungsauskunft nach Ihren Angaben mit dem Berechnungsprogramm des",{"$nulls":13},"Nebenrechnung"]
[]
[null,"Thüringer Landesamtes für Finanzen",{"$nulls":279},"Grund für den Ruhestand",null,"Schwerbehinderung",null,"Personenkreis"]
[{"$nulls":281},"Erreichen der gesetzlichen Altersgrenze",1,"ja",null,"sonstiger Beamte / Richter",1]
{"$rows_left_out":60}
{"sheet":"Tabelle","index":1,"n_rows":26,"n_cols":23,"rows_kept":26,"hidden":true}
["Anfangs-datum","End-        datum","1.","2.","1. Korrektur wg. Schaltjahr","3.","4.","2. Korrektur wg. Schaltjahr","5.","6.","3. Korrektur wg. Schaltjahr","7.","8.","4. Korrektur wg. Schaltjahr","Korrektur wg. Schaltjahr iVm Zurechnungszeit","Jahre","Tage","gerundet","Bruchteil der Zu-rechnungs-zeit",null,"Zurechnungs-zeit","Jahre","Tage"]
[{"$f":"IF(Vordruck!E22=\"\",\"\",Vordruck!E22)","v":""},{"$f":"IF(Vordruck!JH22<>\"\",Vordruck!JH22,\"\")","v":""},{"$f":"IF(AND(MOD(YEAR(A2),4)=0,MOD(YEAR(B2),4)=0),IF(OR(AND(MONTH(A2)<3,MONTH(B2>2),AND(MONTH(A2)>2,MONTH(B2)<3))),TRUE,FALSE),B2)","v":{"$error":"#VALUE!"}},{"$f":"IF(AND(MOD(YEAR(A2),4)=0,MOD(YEAR(B2),4)=0,OR(AND(MONTH(A2)<3,MONTH(B2)>2,AND(MONTH(A2)>2,MONTH(B2)<3),AND(MONTH(B2)>2,DATE(YEAR(B2),MONTH(A2),DAY(A2))>B2)))),TRUE,FALSE)","v":{"$error":"#VALUE!"}},{"$f":"IF(AND(C2<>\"\",D2<>\"\"),IF(OR(B2=\"\",A2=\"\"),IF(AND(C2=FALSE,D2=TRUE),B2-1,B2),IF(OR(AND(C2=FALSE,D2=TRUE),AND(C2=TRUE,D2=TRUE,(A2-B2)=1)),B2-1,B2)),B2)","v":{"$error":"#VALUE!"}},{"$f":"IF(OR(B2=\"\",A2=\"\"),\"\",IF(AND(MOD(YEAR(A2),4)<>0,MOD(YEAR(B2),4)=0),IF(OR(AND(DAY(B2)=29,MONTH(B2)=2),AND(MONTH(B2)>2,MONTH(A2)<3),AND(MONTH(B2)>2,DATE(YEAR(B2),MONTH(A2),DAY(A2))>B2)),TRUE,FALSE),B2))","v":""},{"$f":"IF(OR(B2=\"\",A2=\"\"),\"\",IF(AND(MOD(YEAR(A2),4)<>0,MOD(YEAR(B2),4)=0,OR(AND(DAY(B2)=29,MONTH(B2)=2,MONTH(A2)>2),AND(MONTH(B2)>2,MONTH(A2)<3),AND(MONTH(B2)<2,DATE(YEAR(B2),MONTH(A2),DAY(A2))>B2))),TRUE,FALSE))","v":""},{"$f":"IF(E2<>\"\",IF(OR(B2=\"\",A2=\"\"),E2,IF(OR(AND(F2=FALSE,D2=TRUE,C2=FALSE),AND(F2=FALSE,G2=TRUE),AND(C2=FALSE,G2=TRUE)),B2-1,IF(OR(B2=\"\",A2=\"\"),E2,IF(AND(OR(AND(D2=TRUE,F2=TRUE),AND(F2=TRUE,G2=TRUE),AND(C2=TRUE,G2=TRUE)),(0-B2)=1),B2-1,E2)))),E2)","v":{"$error":"#VALUE!"}},{"$f":"IF(OR(B2=\"\",A2=\"\"),\"\",IF(AND(MOD(YEAR(A2),4)=0,MOD(YEAR(B2),4)<>0),IF(AND(MONTH(A2)<3,OR(MONTH(B2)<MONTH(A2),AND(MONTH(B2)=MONTH(A2),DAY(B2)<DAY(A2)))),TRUE,FALSE),B2))","v":""},{"$f":"IF(OR(B2=\"\",A2=\"\"),\"\",IF(AND(MOD(YEAR(A2),4)=0,MOD(YEAR(B2),4)<>0,YEAR(B2)-1=YEAR(A2),AND(DATE(YEAR(B2),MONTH(A2),DAY(A2))>B2,MONTH(A2)<3)),TRUE,FALSE))","v":""},{"$f":"IF(AND(E2<>\"\",H2<>\"\"),IF(OR(B2=\"\",A2=\"\"),H2,IF(OR(AND(I2=FALSE,J2=TRUE),AND(I2=TRUE,J2=TRUE,(0-B2)=1)),IF(AND(J2=TRUE,L2=TRUE,(0-B2)<>1),H2,B2-1),H2)),H2)","v":{"$error":"#VALUE!"}},{"$f":"IF(OR(B2=\"\",A2=\"\"),\"\",IF(AND(MOD(YEAR(A2),4)<>0,MOD((YEAR(B2)-1),4)=0,MONTH(A2)<3,DATE(YEAR(B2),MONTH(A2),DAY(A2))>B2),TRUE,FALSE))","v":""},{"$f":"IF(OR(B2=\"\",A2=\"\"),\"\",IF(AND(MOD(YEAR(A2),4)<>0,MOD((YEAR(B2)-1),4)=0,MONTH(A2)<3,DATE(YEAR(B2),MONTH(A2),DAY(A2))>B2),TRUE,FALSE))","v":""},{"$f":"IF(AND(E2<>\"\",H2<>\"\"),IF(OR(B2=\"\",A2=\"\"),K2,IF(OR(AND(I2=FALSE,M2=TRUE),AND(L2=FALSE,M2=TRUE),AND(I2=TRUE,M2=TRUE),AND(L2=TRUE,M2=TRUE,(0-B2)=1)),B2-1,K2)),K2)","v":{"$error":"#VALUE!"}},{"$f":"IF(AND(E2<>\"\",H2<>\"\"),IF(OR(B2=\"\",A2=\"\"),K2,IF(OR(AND(I2=FALSE,M2=TRUE),AND(L2=FALSE,M2=TRUE),AND(I2=TRUE,M2=TRUE),AND(L2=TRUE,M2=TRUE,(0-B2)=1)),B2-1,K2)),K2)","v":{"$error":"#VALUE!"}},{"$f":"IF(OR(A2=\"\",A2=0),\"\",IF(AND(DAY(A2)=1,MONTH(A2)=1,DAY(B2)=31,MONTH(B2)=12),YEAR(B2)-YEAR(A2)+1,IF(OR(MONTH(B2)>MONTH(A2),(AND(MONTH(B2)=MONTH(A2),DAY(B2)>=DAY(A2))),(DATE(YEAR(B2),MONTH(A2),DAY(A2)))-B2=1),YEAR(B2)-YEAR(A2),(YEAR(B2)-1)-YEAR(A2))))","v":""},{"$f":"IF(OR(A2=\"\",A2=0),\"\",IF(AND(DAY(A2)=1,MONTH(A2)=1,DAY(B2)=31,MONTH(B2)=12),0,IF(DATE(YEAR(B2),MONTH(A2),DAY(A2))-B2=1,0,IF(B2>=(DATE(YEAR(B2),MONTH(A2),DAY(A2))),B2-DATE(YEAR(B2),MONTH(A2),DAY(A2))+1,B2-(DATE(YEAR(B2)-1,MONTH(A2),DAY(A2)))+1))))","v":""},{"$f":"IF(Q2=0,0,IF(Q2=\"\",\"\",ROUNDDOWN((Q2+0.009),2)))","v":""}]
[{"$f":"IF(Vordruck!E23=\"\",\"\",Vordruck!E23)","v":""},{"$f":"IF(Vordruck!JH23<>\"\",Vordruck!JH23,\"\")","v":""},{"$f":"IF(AND(MOD(YEAR(A3),4)=0,MOD(YEAR(B3),4)=0),IF(OR(AND(MONTH(A3)<3,MONTH(B3>2),AND(MONTH(A3)>2,MONTH(B3)<3))),TRUE,FALSE),B3)","v":{"$error":"#VALUE!"}},{"$f":"IF(AND(MOD(YEAR(A3),4)=0,MOD(YEAR(B3),4)=0,OR(AND(MONTH(A3)<3,MONTH(B3)>2,AND(MONTH(A3)>2,MONTH(B3)<3),AND(MONTH(B3)>2,DATE(YEAR(B3),MONTH(A3),DAY(A3))>B3)))),TRUE,FALSE)","v":{"$error":"#VALUE!"}},{"$f":"IF(AND(C3<>\"\",D3<>\"\"),IF(OR(B3=\"\",A3=\"\"),IF(AND(C3=FALSE,D3=TRUE),B3-1,B3),IF(OR(AND(C3=FALSE,D3=TRUE),AND(C3=TRUE,D3=TRUE,(A3-B3)=1)),B3-1,B3)),B3)","v":{"$error":"#VALUE!"}},{"$f":"IF(OR(B3=\"\",A3=\"\"),\"\",IF(AND(MOD(YEAR(A3),4)<>0,MOD(YEAR(B3),4)=0),IF(OR(AND(DAY(B3)=29,MONTH(B3)=2),AND(MONTH(B3)>2,MONTH(A3)<3),AND(MONTH(B3)>2,DATE(YEAR(B3),MONTH(A3),DAY(A3))>B3)),TRUE,FALSE),B3))","v":""},{"$f":"IF(OR(B3=\"\",A3=\"\"),\"\",IF(AND(MOD(YEAR(A3),4)<>0,MOD(YEAR(B3),4)=0,OR(AND(DAY(B3)=29,MONTH(B3)=2,MONTH(A3)>2),AND(MONTH(B3)>2,MONTH(A3)<3),AND(MONTH(B3)<2,DATE(YEAR(B3),MONTH(A3),DAY(A3))>B3))),TRUE,FALSE))","v":""},{"$f":"IF(E3<>\"\",IF(OR(B3=\"\",A3=\"\"),E3,IF(OR(AND(F3=FALSE,D3=TRUE,C3=FALSE),AND(F3=FALSE,G3=TRUE),AND(C3=FALSE,G3=TRUE)),B3-1,IF(OR(B3=\"\",A3=\"\"),E3,IF(AND(OR(AND(D3=TRUE,F3=TRUE),AND(F3=TRUE,G3=TRUE),AND(C3=TRUE,G3=TRUE)),(0-B3)=1),B3-1,E3)))),E3)","v":{"$error":"#VALUE!"}},{"$f":"IF(OR(B3=\"\",A3=\"\"),\"\",IF(AND(MOD(YEAR(A3),4)=0,MOD(YEAR(B3),4)<>0),IF(AND(MONTH(A3)<3,OR(MONTH(B3)<MONTH(A3),AND(MONTH(B3)=MONTH(A3),DAY(B3)<DAY(A3)))),TRUE,FALSE),B3))","v":""},{"$f":"IF(OR(B3=\"\",A3=\"\"),\"\",IF(AND(MOD(YEAR(A3),4)=0,MOD(YEAR(B3),4)<>0,YEAR(B3)-1=YEAR(A3),AND(DATE(YEAR(B3),MONTH(A3),DAY(A3))>B3,MONTH(A3)<3)),TRUE,FALSE))","v":""},{"$f":"IF(AND(E3<>\"\",H3<>\"\"),IF(OR(B3=\"\",A3=\"\"),H3,IF(OR(AND(I3=FALSE,J3=TRUE),AND(I3=TRUE,J3=TRUE,(0-B3)=1)),IF(AND(J3=TRUE,L3=TRUE,(0-B3)<>1),H3,B3-1),H3)),H3)","v":{"$error":"#VALUE!"}},{"$f":"IF(OR(B3=\"\",A3=\"\"),\"\",IF(AND(MOD(YEAR(A3),4)<>0,MOD((YEAR(B3)-1),4)=0,MONTH(A3)<3,DATE(YEAR(B3),MONTH(A3),DAY(A3))>B3),TRUE,FALSE))","v":""},{"$f":"IF(OR(B3=\"\",A3=\"\"),\"\",IF(AND(MOD(YEAR(A3),4)<>0,MOD((YEAR(B3)-1),4)=0,MONTH(A3)<3,DATE(YEAR(B3),MONTH(A3),DAY(A3))>B3),TRUE,FALSE))","v":""},{"$f":"IF(AND(E3<>\"\",H3<>\"\"),IF(OR(B3=\"\",A3=\"\"),K3,IF(OR(AND(I3=FALSE,M3=TRUE),AND(L3=FALSE,M3=TRUE),AND(I3=TRUE,M3=TRUE),AND(L3=TRUE,M3=TRUE,(0-B3)=1)),B3-1,K3)),K3)","v":{"$error":"#VALUE!"}},{"$f":"IF(AND(E3<>\"\",H3<>\"\"),IF(OR(B3=\"\",A3=\"\"),K3,IF(OR(AND(I3=FALSE,M3=TRUE),AND(L3=FALSE,M3=TRUE),AND(I3=TRUE,M3=TRUE),AND(L3=TRUE,M3=TRUE,(0-B3)=1)),B3-1,K3)),K3)","v":{"$error":"#VALUE!"}},{"$f":"IF(OR(A3=\"\",A3=0),\"\",IF(AND(DAY(A3)=1,MONTH(A3)=1,DAY(B3)=31,MONTH(B3)=12),YEAR(B3)-YEAR(A3)+1,IF(OR(MONTH(B3)>MONTH(A3),(AND(MONTH(B3)=MONTH(A3),DAY(B3)>=DAY(A3))),(DATE(YEAR(B3),MONTH(A3),DAY(A3)))-B3=1),YEAR(B3)-YEAR(A3),(YEAR(B3)-1)-YEAR(A3))))","v":""},{"$f":"IF(OR(A3=\"\",A3=0),\"\",IF(AND(DAY(A3)=1,MONTH(A3)=1,DAY(B3)=31,MONTH(B3)=12),0,IF(DATE(YEAR(B3),MONTH(A3),DAY(A3))-B3=1,0,IF(B3>=(DATE(YEAR(B3),MONTH(A3),DAY(A3))),B3-DATE(YEAR(B3),MONTH(A3),DAY(A3))+1,B3-(DATE(YEAR(B3)-1,MONTH(A3),DAY(A3)))+1))))","v":""},{"$f":"IF(Q3=0,0,IF(Q3=\"\",\"\",ROUNDDOWN((Q3+0.009),2)))","v":""}]
[{"$f":"IF(Vordruck!E24=\"\",\"\",Vordruck!E24)","v":""},{"$f":"IF(Vordruck!JH24<>\"\",Vordruck!JH24,\"\")","v":""},{"$error":"#VALUE!"},{"$error":"#VALUE!"},{"$error":"#VALUE!"},"","",{"$error":"#VALUE!"},"","",{"$error":"#VALUE!"},"","",{"$error":"#VALUE!"},{"$error":"#VALUE!"},"","",""]
[{"$f":"IF(Vordruck!E25=\"\",\"\",Vordruck!E25)","v":""},{"$f":"IF(Vordruck!JH25<>\"\",Vordruck!JH25,\"\")","v":""},{"$error":"#VALUE!"},{"$error":"#VALUE!"},{"$error":"#VALUE!"},"","",{"$error":"#VALUE!"},"","",{"$error":"#VALUE!"},"","",{"$error":"#VALUE!"},{"$error":"#VALUE!"},"","",""]
[{"$f":"IF(Vordruck!E26=\"\",\"\",Vordruck!E26)","v":""},{"$f":"IF(Vordruck!JH26<>\"\",Vordruck!JH26,\"\")","v":""},{"$error":"#VALUE!"},{"$error":"#VALUE!"},{"$error":"#VALUE!"},"","",{"$error":"#VALUE!"},"","",{"$error":"#VALUE!"},"","",{"$error":"#VALUE!"},{"$error":"#VALUE!"},"","",""]
{"$rows_left_out":21}
{"sheet":"Tabelle Vergleich","index":2,"n_rows":26,"n_cols":23,"rows_kept":26,"hidden":true}
["Anfangs-datum","End-        datum","1.","2.","1. Korrektur wg. Schaltjahr","3.","4.","2. Korrektur wg. Schaltjahr","5.","6.","3. Korrektur wg. Schaltjahr","7.","8.","4. Korrektur wg. Schaltjahr","Korrektur wg. Schaltjahr iVm Zurechnungszeit","Jahre","Tage","gerundet","Bruchteil der Zu-rechnungs-zeit",null,"Zurechnungs-zeit","Jahre","Tage"]
[{"$f":"IF(Vordruck!JL22=\"\",\"\",Vordruck!JL22)","v":""},{"$f":"IF(Vordruck!JM22<>\"\",Vordruck!JM22,\"\")","v":""},{"$f":"IF(AND(MOD(YEAR(A2),4)=0,MOD(YEAR(B2),4)=0),IF(OR(AND(MONTH(A2)<3,MONTH(B2>2),AND(MONTH(A2)>2,MONTH(B2)<3))),TRUE,FALSE),B2)","v":{"$error":"#VALUE!"}},{"$f":"IF(AND(MOD(YEAR(A2),4)=0,MOD(YEAR(B2),4)=0,OR(AND(MONTH(A2)<3,MONTH(B2)>2,AND(MONTH(A2)>2,MONTH(B2)<3),AND(MONTH(B2)>2,DATE(YEAR(B2),MONTH(A2),DAY(A2))>B2)))),TRUE,FALSE)","v":{"$error":"#VALUE!"}},{"$f":"IF(AND(C2<>\"\",D2<>\"\"),IF(OR(B2=\"\",A2=\"\"),IF(AND(C2=FALSE,D2=TRUE),B2-1,B2),IF(OR(AND(C2=FALSE,D2=TRUE),AND(C2=TRUE,D2=TRUE,(A2-B2)=1)),B2-1,B2)),B2)","v":{"$error":"#VALUE!"}},{"$f":"IF(OR(B2=\"\",A2=\"\"),\"\",IF(AND(MOD(YEAR(A2),4)<>0,MOD(YEAR(B2),4)=0),IF(OR(AND(DAY(B2)=29,MONTH(B2)=2),AND(MONTH(B2)>2,MONTH(A2)<3),AND(MONTH(B2)>2,DATE(YEAR(B2),MONTH(A2),DAY(A2))>B2)),TRUE,FALSE),B2))","v":""},{"$f":"IF(OR(B2=\"\",A2=\"\"),\"\",IF(AND(MOD(YEAR(A2),4)<>0,MOD(YEAR(B2),4)=0,OR(AND(DAY(B2)=29,MONTH(B2)=2,MONTH(A2)>2),AND(MONTH(B2)>2,MONTH(A2)<3),AND(MONTH(B2)<2,DATE(YEAR(B2),MONTH(A2),DAY(A2))>B2))),TRUE,FALSE))","v":""},{"$f":"IF(E2<>\"\",IF(OR(B2=\"\",A2=\"\"),E2,IF(OR(AND(F2=FALSE,D2=TRUE,C2=FALSE),AND(F2=FALSE,G2=TRUE),AND(C2=FALSE,G2=TRUE)),B2-1,IF(OR(B2=\"\",A2=\"\"),E2,IF(AND(OR(AND(D2=TRUE,F2=TRUE),AND(F2=TRUE,G2=TRUE),AND(C2=TRUE,G2=TRUE)),(0-B2)=1),B2-1,E2)))),E2)","v":{"$error":"#VALUE!"}},{"$f":"IF(OR(B2=\"\",A2=\"\"),\"\",IF(AND(MOD(YEAR(A2),4)=0,MOD(YEAR(B2),4)<>0),IF(AND(MONTH(A2)<3,OR(MONTH(B2)<MONTH(A2),AND(MONTH(B2)=MONTH(A2),DAY(B2)<DAY(A2)))),TRUE,FALSE),B2))","v":""},{"$f":"IF(OR(B2=\"\",A2=\"\"),\"\",IF(AND(MOD(YEAR(A2),4)=0,MOD(YEAR(B2),4)<>0,YEAR(B2)-1=YEAR(A2),AND(DATE(YEAR(B2),MONTH(A2),DAY(A2))>B2,MONTH(A2)<3)),TRUE,FALSE))","v":""},{"$f":"IF(AND(E2<>\"\",H2<>\"\"),IF(OR(B2=\"\",A2=\"\"),H2,IF(OR(AND(I2=FALSE,J2=TRUE),AND(I2=TRUE,J2=TRUE,(0-B2)=1)),IF(AND(J2=TRUE,L2=TRUE,(0-B2)<>1),H2,B2-1),H2)),H2)","v":{"$error":"#VALUE!"}},{"$f":"IF(OR(B2=\"\",A2=\"\"),\"\",IF(AND(MOD(YEAR(A2),4)<>0,MOD((YEAR(B2)-1),4)=0,MONTH(A2)<3,DATE(YEAR(B2),MONTH(A2),DAY(A2))>B2),TRUE,FALSE))","v":""},{"$f":"IF(OR(B2=\"\",A2=\"\"),\"\",IF(AND(MOD(YEAR(A2),4)<>0,MOD((YEAR(B2)-1),4)=0,MONTH(A2)<3,DATE(YEAR(B2),MONTH(A2),DAY(A2))>B2),TRUE,FALSE))","v":""},{"$f":"IF(AND(E2<>\"\",H2<>\"\"),IF(OR(B2=\"\",A2=\"\"),K2,IF(OR(AND(I2=FALSE,M2=TRUE),AND(L2=FALSE,M2=TRUE),AND(I2=TRUE,M2=TRUE),AND(L2=TRUE,M2=TRUE,(0-B2)=1)),B2-1,K2)),K2)","v":{"$error":"#VALUE!"}},{"$f":"IF(AND(E2<>\"\",H2<>\"\"),IF(OR(B2=\"\",A2=\"\"),K2,IF(OR(AND(I2=FALSE,M2=TRUE),AND(L2=FALSE,M2=TRUE),AND(I2=TRUE,M2=TRUE),AND(L2=TRUE,M2=TRUE,(0-B2)=1)),B2-1,K2)),K2)","v":{"$error":"#VALUE!"}},{"$f":"IF(OR(A2=\"\",A2=0),\"\",IF(AND(DAY(A2)=1,MONTH(A2)=1,DAY(B2)=31,MONTH(B2)=12),YEAR(B2)-YEAR(A2)+1,IF(OR(MONTH(B2)>MONTH(A2),(AND(MONTH(B2)=MONTH(A2),DAY(B2)>=DAY(A2))),(DATE(YEAR(B2),MONTH(A2),DAY(A2)))-B2=1),YEAR(B2)-YEAR(A2),(YEAR(B2)-1)-YEAR(A2))))","v":""},{"$f":"IF(OR(A2=\"\",A2=0),\"\",IF(AND(DAY(A2)=1,MONTH(A2)=1,DAY(B2)=31,MONTH(B2)=12),0,IF(DATE(YEAR(B2),MONTH(A2),DAY(A2))-B2=1,0,IF(B2>=(DATE(YEAR(B2),MONTH(A2),DAY(A2))),B2-DATE(YEAR(B2),MONTH(A2),DAY(A2))+1,B2-(DATE(YEAR(B2)-1,MONTH(A2),DAY(A2)))+1))))","v":""},{"$f":"IF(Q2=0,0,IF(Q2=\"\",\"\",ROUNDDOWN((Q2+0.009),2)))","v":""}]
[{"$f":"IF(Vordruck!JL23=\"\",\"\",Vordruck!JL23)","v":""},{"$f":"IF(Vordruck!JM23<>\"\",Vordruck!JM23,\"\")","v":""},{"$f":"IF(AND(MOD(YEAR(A3),4)=0,MOD(YEAR(B3),4)=0),IF(OR(AND(MONTH(A3)<3,MONTH(B3>2),AND(MONTH(A3)>2,MONTH(B3)<3))),TRUE,FALSE),B3)","v":{"$error":"#VALUE!"}},{"$f":"IF(AND(MOD(YEAR(A3),4)=0,MOD(YEAR(B3),4)=0,OR(AND(MONTH(A3)<3,MONTH(B3)>2,AND(MONTH(A3)>2,MONTH(B3)<3),AND(MONTH(B3)>2,DATE(YEAR(B3),MONTH(A3),DAY(A3))>B3)))),TRUE,FALSE)","v":{"$error":"#VALUE!"}},{"$f":"IF(AND(C3<>\"\",D3<>\"\"),IF(OR(B3=\"\",A3=\"\"),IF(AND(C3=FALSE,D3=TRUE),B3-1,B3),IF(OR(AND(C3=FALSE,D3=TRUE),AND(C3=TRUE,D3=TRUE,(A3-B3)=1)),B3-1,B3)),B3)","v":{"$error":"#VALUE!"}},{"$f":"IF(OR(B3=\"\",A3=\"\"),\"\",IF(AND(MOD(YEAR(A3),4)<>0,MOD(YEAR(B3),4)=0),IF(OR(AND(DAY(B3)=29,MONTH(B3)=2),AND(MONTH(B3)>2,MONTH(A3)<3),AND(MONTH(B3)>2,DATE(YEAR(B3),MONTH(A3),DAY(A3))>B3)),TRUE,FALSE),B3))","v":""},{"$f":"IF(OR(B3=\"\",A3=\"\"),\"\",IF(AND(MOD(YEAR(A3),4)<>0,MOD(YEAR(B3),4)=0,OR(AND(DAY(B3)=29,MONTH(B3)=2,MONTH(A3)>2),AND(MONTH(B3)>2,MONTH(A3)<3),AND(MONTH(B3)<2,DATE(YEAR(B3),MONTH(A3),DAY(A3))>B3))),TRUE,FALSE))","v":""},{"$f":"IF(E3<>\"\",IF(OR(B3=\"\",A3=\"\"),E3,IF(OR(AND(F3=FALSE,D3=TRUE,C3=FALSE),AND(F3=FALSE,G3=TRUE),AND(C3=FALSE,G3=TRUE)),B3-1,IF(OR(B3=\"\",A3=\"\"),E3,IF(AND(OR(AND(D3=TRUE,F3=TRUE),AND(F3=TRUE,G3=TRUE),AND(C3=TRUE,G3=TRUE)),(0-B3)=1),B3-1,E3)))),E3)","v":{"$error":"#VALUE!"}},{"$f":"IF(OR(B3=\"\",A3=\"\"),\"\",IF(AND(MOD(YEAR(A3),4)=0,MOD(YEAR(B3),4)<>0),IF(AND(MONTH(A3)<3,OR(MONTH(B3)<MONTH(A3),AND(MONTH(B3)=MONTH(A3),DAY(B3)<DAY(A3)))),TRUE,FALSE),B3))","v":""},{"$f":"IF(OR(B3=\"\",A3=\"\"),\"\",IF(AND(MOD(YEAR(A3),4)=0,MOD(YEAR(B3),4)<>0,YEAR(B3)-1=YEAR(A3),AND(DATE(YEAR(B3),MONTH(A3),DAY(A3))>B3,MONTH(A3)<3)),TRUE,FALSE))","v":""},{"$f":"IF(AND(E3<>\"\",H3<>\"\"),IF(OR(B3=\"\",A3=\"\"),H3,IF(OR(AND(I3=FALSE,J3=TRUE),AND(I3=TRUE,J3=TRUE,(0-B3)=1)),IF(AND(J3=TRUE,L3=TRUE,(0-B3)<>1),H3,B3-1),H3)),H3)","v":{"$error":"#VALUE!"}},{"$f":"IF(OR(B3=\"\",A3=\"\"),\"\",IF(AND(MOD(YEAR(A3),4)<>0,MOD((YEAR(B3)-1),4)=0,MONTH(A3)<3,DATE(YEAR(B3),MONTH(A3),DAY(A3))>B3),TRUE,FALSE))","v":""},{"$f":"IF(OR(B3=\"\",A3=\"\"),\"\",IF(AND(MOD(YEAR(A3),4)<>0,MOD((YEAR(B3)-1),4)=0,MONTH(A3)<3,DATE(YEAR(B3),MONTH(A3),DAY(A3))>B3),TRUE,FALSE))","v":""},{"$f":"IF(AND(E3<>\"\",H3<>\"\"),IF(OR(B3=\"\",A3=\"\"),K3,IF(OR(AND(I3=FALSE,M3=TRUE),AND(L3=FALSE,M3=TRUE),AND(I3=TRUE,M3=TRUE),AND(L3=TRUE,M3=TRUE,(0-B3)=1)),B3-1,K3)),K3)","v":{"$error":"#VALUE!"}},{"$f":"IF(AND(E3<>\"\",H3<>\"\"),IF(OR(B3=\"\",A3=\"\"),K3,IF(OR(AND(I3=FALSE,M3=TRUE),AND(L3=FALSE,M3=TRUE),AND(I3=TRUE,M3=TRUE),AND(L3=TRUE,M3=TRUE,(0-B3)=1)),B3-1,K3)),K3)","v":{"$error":"#VALUE!"}},{"$f":"IF(OR(A3=\"\",A3=0),\"\",IF(AND(DAY(A3)=1,MONTH(A3)=1,DAY(B3)=31,MONTH(B3)=12),YEAR(B3)-YEAR(A3)+1,IF(OR(MONTH(B3)>MONTH(A3),(AND(MONTH(B3)=MONTH(A3),DAY(B3)>=DAY(A3))),(DATE(YEAR(B3),MONTH(A3),DAY(A3)))-B3=1),YEAR(B3)-YEAR(A3),(YEAR(B3)-1)-YEAR(A3))))","v":""},{"$f":"IF(OR(A3=\"\",A3=0),\"\",IF(AND(DAY(A3)=1,MONTH(A3)=1,DAY(B3)=31,MONTH(B3)=12),0,IF(DATE(YEAR(B3),MONTH(A3),DAY(A3))-B3=1,0,IF(B3>=(DATE(YEAR(B3),MONTH(A3),DAY(A3))),B3-DATE(YEAR(B3),MONTH(A3),DAY(A3))+1,B3-(DATE(YEAR(B3)-1,MONTH(A3),DAY(A3)))+1))))","v":""},{"$f":"IF(Q3=0,0,IF(Q3=\"\",\"\",ROUNDDOWN((Q3+0.009),2)))","v":""}]
[{"$f":"IF(Vordruck!JL24=\"\",\"\",Vordruck!JL24)","v":""},{"$f":"IF(Vordruck!JM24<>\"\",Vordruck!JM24,\"\")","v":""},{"$error":"#VALUE!"},{"$error":"#VALUE!"},{"$error":"#VALUE!"},"","",{"$error":"#VALUE!"},"","",{"$error":"#VALUE!"},"","",{"$error":"#VALUE!"},{"$error":"#VALUE!"},"","",""]
[{"$f":"IF(Vordruck!JL25=\"\",\"\",Vordruck!JL25)","v":""},{"$f":"IF(Vordruck!JM25<>\"\",Vordruck!JM25,\"\")","v":""},{"$error":"#VALUE!"},{"$error":"#VALUE!"},{"$error":"#VALUE!"},"","",{"$error":"#VALUE!"},"","",{"$error":"#VALUE!"},"","",{"$error":"#VALUE!"},{"$error":"#VALUE!"},"","",""]
[{"$f":"IF(Vordruck!JL26=\"\",\"\",Vordruck!JL26)","v":""},{"$f":"IF(Vordruck!JM26<>\"\",Vordruck!JM26,\"\")","v":""},{"$error":"#VALUE!"},{"$error":"#VALUE!"},{"$error":"#VALUE!"},"","",{"$error":"#VALUE!"},"","",{"$error":"#VALUE!"},"","",{"$error":"#VALUE!"},{"$error":"#VALUE!"},"","",""]
{"$rows_left_out":21}
{"sheet":"Nebenrechnung","index":3,"n_rows":130,"n_cols":27,"rows_kept":130,"hidden":true,"merged":[[0,11,0,12],[0,17,0,18],[8,13,33,13],[8,19,33,19]]}
["Geburtsjahr",null,null,"Grund für den Ruhestand",null,"Schwerbehinderung",null,"Personenkreis",null,"Grund + Personenkreis",null,"Regelaltersgrenze",null,"Lehrer","Professoren",null,null,"Altersgrenze - Antrag",{"$nulls":3},"Abschlagsberechnung",null,"Schwerbeh","Hinweis"]
[{"$f":"IF(Vordruck!E8<>\"\",Vordruck!E8,\"\")","v":""},null,null,{"$f":"Vordruck!E12","v":"Erreichen der gesetzlichen Altersgrenze"},null,{"$f":"IF(Vordruck!E10=\"nein\",FALSE,TRUE)","v":false},null,{"$f":"Vordruck!E14","v":"sonstiger Beamte / Richter"},null,{"$f":"IF(AND(D3>0,H3>0),CONCATENATE(D3&H4)*1,\"\")","v":11},null,"Jahre","Monate","31.1. bzw. 31.7.","31.03.",null,null,"Jahre","Monate",null,null,"vorz. Rentenbeg. bzw. gesetzl. Renteneintritt",{"$f":"IF(D3>2,IF(Vordruck!E18=\"\",\"\",Vordruck!E18),M7-1)","v":{"$error":"#VALUE!"}},null,{"$f":"IF(AND(D3>2,OR(W2<S7,Vordruck!E18=\"\")),\"Beachte: frühester Versorgungsbeginn \"&TEXT(S7,\"TT.MM.JJJJ\"),\"\")","v":{"$error":"#VALUE!"}}]
[{"$nulls":3},{"$f":"VLOOKUP(D2,Vordruck!JV6:JW9,2,FALSE)","v":1},{"$nulls":3},{"$f":"VLOOKUP(H2,Vordruck!JZ6:KA12,2,FALSE)","v":1},{"$nulls":3},{"$f":"IF(AND($D$3>0,$H$3>0),VLOOKUP($A$2,INDIRECT(N9),2),\"\")","v":{"$error":"#N/A"}},{"$f":"IF(AND($D$3>0,$H$3>0),VLOOKUP($A$2,INDIRECT(N9),3),\"\")","v":{"$error":"#N/A"}},null,"30.09.",null,null,{"$f":"IF(AND($D$3>0,$H$3>0),VLOOKUP($A$2,INDIRECT(T9),2),\"\")","v":{"$error":"#N/A"}},{"$f":"IF(AND($D$3>0,$H$3>0),VLOOKUP($A$2,INDIRECT(T9),3),\"\")","v":{"$error":"#N/A"}},null,null,"Regelaltersgrenze",{"$f":"IF(X3<>\"\",X3,M6)","v":{"$error":"#VALUE!"}},{"$f":"IF(F2=TRUE,IF(M6<EOMONTH(DATE(YEAR(M4)+65,MONTH(M4),DAY(M4))-1,0),M6,EOMONTH(DATE(YEAR(M4)+65,MONTH(M4),DAY(M4))-1,0)),\"\")","v":""},null,null,"Versorgungsabschlag bei Schwerbehinderung: max bis zum 65Lj"]
[{"$nulls":7},{"$f":"IF(OR(H3=1,H3=2,H3=5),1,H3)","v":1},{"$nulls":3},"Geb ",{"$f":"$A$2","v":""},{"$nulls":4},"Geb ",{"$f":"$A$2","v":""},null,null,"Diff. Jahr(e)+Tag(e)",{"$f":"IF(W2>W3,0,'Tabelle Abschlagsber'!P2)","v":{"$error":"#VALUE!"}},{"$f":"IF(W2>W3,0,'Tabelle Abschlagsber'!R2)","v":{"$error":"#VALUE!"}}]
[{"$nulls":11}," + Jahre ./. 1",{"$f":"DATE(YEAR(M4)+L3,MONTH(M4),DAY(M4))-1","v":{"$error":"#VALUE!"}},{"$f":"EOMONTH($M$6,0)","v":{"$error":"#VALUE!"}},{"$f":"EOMONTH($M$6,0)","v":{"$error":"#VALUE!"}},null,null," + Jahre ./. 1 ",{"$f":"DATE(YEAR(S4)+R3,MONTH(S4),DAY(S4))-1","v":{"$error":"#VALUE!"}},null,null,"umgerechnet",{"$f":"W4+(ROUND(X4/365,2))","v":{"$error":"#VALUE!"}}]
["vss. Versorgungsbeginn bei ",{"$nulls":3},"vss. Versorgungsbeginn bei ",{"$nulls":6}," + Monate -> Monatsende",{"$f":"EOMONTH(EDATE(M5,M3),0)","v":{"$error":"#VALUE!"}},{"$f":"IF(H3=2,IF(OR(D3=1,D3=3),IF(MONTH(N5)=1,N5,IF(MONTH(N5)<8,DATE(YEAR(N5),7,31),DATE(YEAR(N5)+1,1,31))),IF(MONTH(N5)<8,DATE(YEAR(N5),7,31),DATE(YEAR(N5)+1,7,31))),\"\")","v":""},{"$f":"IF(H3=5,IF(MONTH(O5)<=3,DATE(YEAR(O5),3,31),IF(MONTH(O5)<10,DATE(YEAR(O5),9,30),DATE(YEAR(O5)+1,3,31))),\"\")","v":""},null,null," + Monate -> Monatsende",{"$f":"EOMONTH(EDATE(S5,S3),0)","v":{"$error":"#VALUE!"}},null,null," x 3,6% (höchstens 18/10,8%)",{"$f":"IF(F2=FALSE,IF(W5*3.6<=18,ROUND(W5*3.6,2),18),IF(W5*3.6<=10.8,ROUND(W5*3.6,2),10.8))","v":{"$error":"#VALUE!"}}]
{"$rows_left_out":125}
{"sheet":"Tabelle Abschlagsber","index":4,"n_rows":2,"n_cols":18,"rows_kept":2,"hidden":true}
["Anfangs-datum","End-        datum","1.","2.","1. Korrektur wg. Schaltjahr","3.","4.","2. Korrektur wg. Schaltjahr","5.","6.","3. Korrektur wg. Schaltjahr","7.","8.","4. Korrektur wg. Schaltjahr","Korrektur wg. Schaltjahr iVm Zurechnungszeit","Jahre","Tage","gerundet"]
[{"$f":"IF(Nebenrechnung!W2=\"\",\"\",Nebenrechnung!W2)","v":{"$error":"#VALUE!"}},{"$f":"IF(Nebenrechnung!W3=\"\",\"\",Nebenrechnung!W3)","v":{"$error":"#VALUE!"}},{"$f":"IF(AND(MOD(YEAR(A2),4)=0,MOD(YEAR(B2),4)=0),IF(OR(AND(MONTH(A2)<3,MONTH(B2>2),AND(MONTH(A2)>2,MONTH(B2)<3))),TRUE,FALSE),B2)","v":{"$error":"#VALUE!"}},{"$f":"IF(AND(MOD(YEAR(A2),4)=0,MOD(YEAR(B2),4)=0,OR(AND(MONTH(A2)<3,MONTH(B2)>2,AND(MONTH(A2)>2,MONTH(B2)<3),AND(MONTH(B2)>2,DATE(YEAR(B2),MONTH(A2),DAY(A2))>B2)))),TRUE,FALSE)","v":{"$error":"#VALUE!"}},{"$f":"IF(AND(C2<>\"\",D2<>\"\"),IF(OR(B2=\"\",A2=\"\"),IF(AND(C2=FALSE,D2=TRUE),B2-1,B2),IF(OR(AND(C2=FALSE,D2=TRUE),AND(C2=TRUE,D2=TRUE,(A2-B2)=1)),B2-1,B2)),B2)","v":{"$error":"#VALUE!"}},{"$f":"IF(OR(B2=\"\",A2=\"\"),\"\",IF(AND(MOD(YEAR(A2),4)<>0,MOD(YEAR(B2),4)=0),IF(OR(AND(DAY(B2)=29,MONTH(B2)=2),AND(MONTH(B2)>2,MONTH(A2)<3),AND(MONTH(B2)>2,DATE(YEAR(B2),MONTH(A2),DAY(A2))>B2)),TRUE,FALSE),B2))","v":{"$error":"#VALUE!"}},{"$f":"IF(OR(B2=\"\",A2=\"\"),\"\",IF(AND(MOD(YEAR(A2),4)<>0,MOD(YEAR(B2),4)=0,OR(AND(DAY(B2)=29,MONTH(B2)=2,MONTH(A2)>2),AND(MONTH(B2)>2,MONTH(A2)<3),AND(MONTH(B2)<2,DATE(YEAR(B2),MONTH(A2),DAY(A2))>B2))),TRUE,FALSE))","v":{"$error":"#VALUE!"}},{"$f":"IF(E2<>\"\",IF(OR(B2=\"\",A2=\"\"),E2,IF(OR(AND(F2=FALSE,D2=TRUE,C2=FALSE),AND(F2=FALSE,G2=TRUE),AND(C2=FALSE,G2=TRUE)),B2-1,IF(OR(B2=\"\",A2=\"\"),E2,IF(AND(OR(AND(D2=TRUE,F2=TRUE),AND(F2=TRUE,G2=TRUE),AND(C2=TRUE,G2=TRUE)),(0-B2)=1),B2-1,E2)))),E2)","v":{"$error":"#VALUE!"}},{"$f":"IF(OR(B2=\"\",A2=\"\"),\"\",IF(AND(MOD(YEAR(A2),4)=0,MOD(YEAR(B2),4)<>0),IF(AND(MONTH(A2)<3,OR(MONTH(B2)<MONTH(A2),AND(MONTH(B2)=MONTH(A2),DAY(B2)<DAY(A2)))),TRUE,FALSE),B2))","v":{"$error":"#VALUE!"}},{"$f":"IF(OR(B2=\"\",A2=\"\"),\"\",IF(AND(MOD(YEAR(A2),4)=0,MOD(YEAR(B2),4)<>0,YEAR(B2)-1=YEAR(A2),AND(DATE(YEAR(B2),MONTH(A2),DAY(A2))>B2,MONTH(A2)<3)),TRUE,FALSE))","v":{"$error":"#VALUE!"}},{"$f":"IF(AND(E2<>\"\",H2<>\"\"),IF(OR(B2=\"\",A2=\"\"),H2,IF(OR(AND(I2=FALSE,J2=TRUE),AND(I2=TRUE,J2=TRUE,(0-B2)=1)),IF(AND(J2=TRUE,L2=TRUE,(0-B2)<>1),H2,B2-1),H2)),H2)","v":{"$error":"#VALUE!"}},{"$f":"IF(OR(B2=\"\",A2=\"\"),\"\",IF(AND(MOD(YEAR(A2),4)<>0,MOD((YEAR(B2)-1),4)=0,MONTH(A2)<3,DATE(YEAR(B2),MONTH(A2),DAY(A2))>B2),TRUE,FALSE))","v":{"$error":"#VALUE!"}},{"$f":"IF(OR(B2=\"\",A2=\"\"),\"\",IF(AND(MOD(YEAR(A2),4)<>0,MOD((YEAR(B2)-1),4)=0,MONTH(A2)<3,DATE(YEAR(B2),MONTH(A2),DAY(A2))>B2),TRUE,FALSE))","v":{"$error":"#VALUE!"}},{"$f":"IF(AND(E2<>\"\",H2<>\"\"),IF(OR(B2=\"\",A2=\"\"),K2,IF(OR(AND(I2=FALSE,M2=TRUE),AND(L2=FALSE,M2=TRUE),AND(I2=TRUE,M2=TRUE),AND(L2=TRUE,M2=TRUE,(0-B2)=1)),B2-1,K2)),K2)","v":{"$error":"#VALUE!"}},{"$f":"IF(AND(E2<>\"\",H2<>\"\"),IF(OR(B2=\"\",A2=\"\"),K2,IF(OR(AND(I2=FALSE,M2=TRUE),AND(L2=FALSE,M2=TRUE),AND(I2=TRUE,M2=TRUE),AND(L2=TRUE,M2=TRUE,(0-B2)=1)),B2-1,K2)),K2)","v":{"$error":"#VALUE!"}},{"$f":"IF(OR(A2=\"\",A2=0),\"\",IF(AND(DAY(A2)=1,MONTH(A2)=1,DAY(B2)=31,MONTH(B2)=12),YEAR(B2)-YEAR(A2)+1,IF(OR(MONTH(B2)>MONTH(A2),(AND(MONTH(B2)=MONTH(A2),DAY(B2)>=DAY(A2))),(DATE(YEAR(B2),MONTH(A2),DAY(A2)))-B2=1),YEAR(B2)-YEAR(A2),(YEAR(B2)-1)-YEAR(A2))))","v":{"$error":"#VALUE!"}},{"$f":"IF(OR(A2=\"\",A2=0),\"\",IF(AND(DAY(A2)=1,MONTH(A2)=1,DAY(B2)=31,MONTH(B2)=12),0,IF(DATE(YEAR(B2),MONTH(A2),DAY(A2))-B2=1,0,IF(B2>=(DATE(YEAR(B2),MONTH(A2),DAY(A2))),B2-DATE(YEAR(B2),MONTH(A2),DAY(A2))+1,B2-(DATE(YEAR(B2)-1,MONTH(A2),DAY(A2)))+1))))","v":{"$error":"#VALUE!"}},{"$f":"IF(Q2=0,0,IF(Q2=\"\",\"\",ROUNDDOWN((Q2+0.009),2)))","v":{"$error":"#VALUE!"}}]